Uploaded image for project: 'WiredTiger'
  1. WiredTiger
  2. WT-9546

failed: spinlock-gcc-test on ubuntu2004 [wiredtiger @ 6cb26d60]

    XMLWordPrintable

Details

    • Build Failure
    • Status: Open
    • Major - P3
    • Resolution: Unresolved
    • None
    • None
    • None
    • 5
    • StorEng - Refinement Pipeline

    Description

      spinlock-gcc-test on ubuntu2004

      Host: i-07eace1950301236b
      Project: wiredtiger
      Commit: 6cb26d60

      Task Logs:

      spinlock-gcc-test task_log

      Logs:

      Python Stacktrace
      FAIL: test_cursor13.test_cursor13_reopens.test_reopen(file.enable.disable) (subunit.RemotedTestCase)
      test_cursor13.test_cursor13_reopens.test_reopen(file.enable.disable)
      ----------------------------------------------------------------------
      testtools.testresult.real._StringException: Traceback (most recent call last):
        File "/data/mci/a19f2fe7c1c0ec1fbfadd400452f2d48/wiredtiger/test/suite/wttest.py", line 328, in _callTestMethod
          method()
        File "/data/mci/a19f2fe7c1c0ec1fbfadd400452f2d48/wiredtiger/test/suite/test_cursor13.py", line 252, in test_reopen
          self.basic_reopen(100, True, caching)
        File "/data/mci/a19f2fe7c1c0ec1fbfadd400452f2d48/wiredtiger/test/suite/test_cursor13.py", line 209, in basic_reopen
          self.basic_populate(self.uri, caching_enabled)
        File "/data/mci/a19f2fe7c1c0ec1fbfadd400452f2d48/wiredtiger/test/suite/test_cursor13.py", line 188, in basic_populate
          self.assert_cursor_reopened(caching_enabled)
        File "/data/mci/a19f2fe7c1c0ec1fbfadd400452f2d48/wiredtiger/test/suite/test_cursor13.py", line 109, in assert_cursor_reopened
          self.assertEqual(stats[1], self.stat_cursor_reopen)
        File "/opt/mongodbtoolchain/revisions/c6da1cf7f0b4b60d53566305e59857d3d540dcf7/stow/python3-v3.9MG/lib/python3.9/unittest/case.py", line 831, in assertEqual
          assertion_func(first, second, msg=msg)
        File "/opt/mongodbtoolchain/revisions/c6da1cf7f0b4b60d53566305e59857d3d540dcf7/stow/python3-v3.9MG/lib/python3.9/unittest/case.py", line 824, in _baseAssertEqual
          raise self.failureException(msg)
      AssertionError: 1 != 0
      ----------------------------------------------------------------------
      Ran 9680 tests in 2236.735s
      Link: https://evergreen.mongodb.com/task_log_raw/wiredtiger_ubuntu2004_spinlock_gcc_test_6cb26d60ec92eabdcb50badee7cc1f2205ba7384_22_07_01_07_29_38/0?type=T#L37352
       
      Evergreen YAML Script Failure
      Command failed: shell script encountered problem: exit code 1
       
      Link: https://evergreen.mongodb.com/task_log_raw/wiredtiger_ubuntu2004_spinlock_gcc_test_6cb26d60ec92eabdcb50badee7cc1f2205ba7384_22_07_01_07_29_38/0?type=T#L37374
      

      logs

      Attachments

        Activity

          People

            backlog-server-storage-engines Backlog - Storage Engines Team
            Xgen-BuildBaron-User xgen-buildbaron-user
            Votes:
            0 Vote for this issue
            Watchers:
            3 Start watching this issue

            Dates

              Created:
              Updated: