Uploaded image for project: 'WiredTiger'
  1. WiredTiger
  2. WT-9600

task-timed-out: unit-test on ubuntu1804-ppc [wiredtiger @ f0973921]

    • Type: Icon: Build Failure Build Failure
    • Resolution: Duplicate
    • Priority: Icon: Major - P3 Major - P3
    • None
    • Affects Version/s: None
    • Component/s: None
    • Labels:

      unit-test on ubuntu1804-ppc

      Host: ubuntu1804-ppc-5.pic.build.10gen.cc
      Project: wiredtiger
      Commit: f0973921

      Task Logs:

      unit-test task_log

      Logs:

      Evergreen YAML Script Failure
      Command failed: shell script encountered problem: exit code 1
      
      Link: https://evergreen.mongodb.com/task_log_raw/wiredtiger_ubuntu1804_ppc_unit_test_f0973921f60c967f65ec74aa063aef51fc148de0_22_07_15_01_46_59/0?type=T#L29791
      
      Verbose Error message
      [1657871936:861689][19071:0x711961935040], test_txn19.test_txn19_meta.test_corrupt_meta(integer-row.garbage-begin.WiredTiger.turtle), connection: [WT_VERB_DEFAULT][ERROR]: __wt_turtle_read, 667: WiredTiger.turtle: fatal turtle file read error: WT_TRY_SALVAGE: database corruption detected
      [1657871936:861772][19071:0x711961935040], test_txn19.test_txn19_meta.test_corrupt_meta(integer-row.garbage-begin.WiredTiger.turtle), connection: [WT_VERB_DEFAULT][ERROR]: __wt_turtle_read, 667: the process must exit and restart: WT_PANIC: WiredTiger library panic
      [1657871936:861789][19071:0x711961935040], test_txn19.test_txn19_meta.test_corrupt_meta(integer-row.garbage-begin.WiredTiger.turtle), connection: [WT_VERB_DEFAULT][ERROR]: __wt_turtle_validate_version, 339: Unable to read version string from turtle file: WT_PANIC: WiredTiger library panic
      Link: https://evergreen.mongodb.com/task_log_raw/wiredtiger_ubuntu1804_ppc_unit_test_f0973921f60c967f65ec74aa063aef51fc148de0_22_07_15_01_46_59/0?type=T#L29813
      

      logs

            Assignee:
            backlog-server-storage-engines Backlog - Storage Engines Team
            Reporter:
            Xgen-BuildBaron-User xgen-buildbaron-user
            Votes:
            0 Vote for this issue
            Watchers:
            2 Start watching this issue

              Created:
              Updated:
              Resolved: