Uploaded image for project: 'WiredTiger'
  1. WiredTiger
  2. WT-9728

task-timed-out: cppsuite-burst-inserts-stress on cppsuite-stress-tests [wiredtiger @ c4d67162] - process hang

    XMLWordPrintable

Details

    • Build Failure
    • Status: Closed
    • Major - P3
    • Resolution: Fixed
    • None
    • WT11.1.0, 6.2.0-rc0
    • None
    • 3
    • Storage Engines - 2022-10-31
    • v6.1

    Description

      cppsuite-burst-inserts-stress on cppsuite-stress-tests

      Host: i-0e171f7d8e4ce4508
      Project: wiredtiger
      Commit: c4d67162

      Task Logs:

      cppsuite-burst-inserts-stress task_log

      Logs:

      test_commands
      WT_TOPDIR=$(git rev-parse --show-toplevel) WT_BUILDDIR=$WT_TOPDIR/cmake_build LD_LIBRARY_PATH=$WT_BUILDDIR:$WT_TOPDIR/TCMALLOC_LIB/lib ./run -t burst_inserts -C '' -f configs/burst_inserts_stress.txt -l 2
      Link: https://evergreen.mongodb.com/task_log_raw/wiredtiger_cppsuite_stress_tests_cppsuite_burst_inserts_stress_c4d67162cd2f6a6c9876eaec4fb626c5867e0eaf_22_08_08_03_03_53/0?type=T#L12
       
      Verbose Error message
      [1659929336:7335][8203:0x7f81ebfff700], WT_SESSION.timestamp_transaction: [WT_VERB_DEFAULT][ERROR]: __wt_txn_validate_commit_timestamp, 535: commit timestamp (1659929303, 309888) must be after the stable timestamp (1659929305, 0): Invalid argument
      [1659929439:200768][8203:0x7f8190ff9700], WT_SESSION.commit_transaction: [WT_VERB_DEFAULT][ERROR]: __wt_txn_validate_commit_timestamp, 535: commit timestamp (1659929407, 335450) must be after the stable timestamp (1659929408, 0): Invalid argument
      [1659929518:186004][8203:0x7f81eb7fe700], WT_SESSION.timestamp_transaction: [WT_VERB_DEFAULT][ERROR]: __wt_txn_validate_commit_timestamp, 535: commit timestamp (1659929486, 353313) must be after the stable timestamp (1659929487, 0): Invalid argument
      [1659929563:723554][8203:0x7f81937fe700], WT_SESSION.timestamp_transaction: [WT_VERB_DEFAULT][ERROR]: __wt_txn_validate_commit_timestamp, 535: commit timestamp (1659929529, 362835) must be after the stable timestamp (1659929533, 0): Invalid argument
      [1659929769:368991][8203:0x7f8239ffb700], WT_SESSION.commit_transaction: [WT_VERB_DEFAULT][ERROR]: __wt_txn_validate_commit_timestamp, 535: commit timestamp (1659929737, 411226) must be after the stable timestamp (1659929738, 0): Invalid argument
      [1659929863:217408][8203:0x7f81407e8700], WT_SESSION.commit_transaction: [WT_VERB_DEFAULT][ERROR]: __wt_txn_validate_commit_timestamp, 535: commit timestamp (1659929829, 435129) must be after the stable timestamp (1659929832, 0): Invalid argument
      [1659929934:906999][8203:0x7f8268ff1700], WT_SESSION.timestamp_transaction: [WT_VERB_DEFAULT][ERROR]: __wt_txn_validate_commit_timestamp, 535: commit timestamp (1659929903, 452206) must be after the stable timestamp (1659929904, 0): Invalid argument
      [1659929959:363014][8203:0x7f813cfe1700], WT_SESSION.timestamp_transaction: [WT_VERB_DEFAULT][ERROR]: __wt_txn_validate_commit_timestamp, 535: commit timestamp (1659929927, 456971) must be after the stable timestamp (1659929928, 0): Invalid argument
      [1659929964:123051][8203:0x7f81477f6700], WT_SESSION.timestamp_transaction: [WT_VERB_DEFAULT][ERROR]: __wt_txn_validate_commit_timestamp, 535: commit timestamp (1659929932, 457932) must be after the stable timestamp (1659929933, 0): Invalid argument
      [1659929976:771712][8203:0x7f8220ff9700], WT_SESSION.commit_transaction: [WT_VERB_DEFAULT][ERROR]: __wt_txn_validate_commit_timestamp, 535: commit timestamp (1659929944, 460514) must be after the stable timestamp (1659929946, 0): Invalid argument
      [1659930126:862461][8203:0x7f81417ea700], WT_SESSION.timestamp_transaction: [WT_VERB_DEFAULT][ERROR]: __wt_txn_validate_commit_timestamp, 535: commit timestamp (1659930094, 497951) must be after the stable timestamp (1659930096, 0): Invalid argument
      [1659930127:545967][8203:0x7f8139fdb700], WT_SESSION.timestamp_transaction: [WT_VERB_DEFAULT][ERROR]: __wt_txn_validate_commit_timestamp, 535: commit timestamp (1659930094, 498195) must be after the stable timestamp (1659930096, 0): Invalid argument
      [1659930131:383207][8203:0x7f81437ee700], WT_SESSION.timestamp_transaction: [WT_VERB_DEFAULT][ERROR]: __wt_txn_validate_commit_timestamp, 535: commit timestamp (1659930099, 498919) must be after the stable timestamp (1659930100, 0): Invalid argument
      [1659930152:953227][8203:0x7f8146ff5700], WT_SESSION.timestamp_transaction: [WT_VERB_DEFAULT][ERROR]: __wt_txn_validate_commit_timestamp, 535: commit timestamp (1659930121, 502798) must be after the stable timestamp (1659930122, 0): Invalid argument
      [1659930832:415147][8203:0x7f823affd700], WT_SESSION.timestamp_transaction: [WT_VERB_DEFAULT][ERROR]: __wt_txn_validate_commit_timestamp, 535: commit timestamp (1659930801, 684608) must be after the stable timestamp (1659930802, 0): Invalid argument
      [1659930835:56395][8203:0x7f81497fa700], WT_SESSION.commit_transaction: [WT_VERB_DEFAULT][ERROR]: __wt_txn_validate_commit_timestamp, 535: commit timestamp (1659930803, 685140) must be after the stable timestamp (1659930804, 0): Invalid argument
      [1659930857:144257][8203:0x7f814affd700], WT_SESSION.timestamp_transaction: [WT_VERB_DEFAULT][ERROR]: __wt_txn_validate_commit_timestamp, 535: commit timestamp (1659930826, 690422) must be after the stable timestamp (1659930827, 0): Invalid argument
      Link: https://evergreen.mongodb.com/task_log_raw/wiredtiger_cppsuite_stress_tests_cppsuite_burst_inserts_stress_c4d67162cd2f6a6c9876eaec4fb626c5867e0eaf_22_08_08_03_03_53/0?type=T#L129
       
      Evergreen YAML Script Failure
      Command failed: shell script encountered problem: exit code 1
       
      Link: https://evergreen.mongodb.com/task_log_raw/wiredtiger_cppsuite_stress_tests_cppsuite_burst_inserts_stress_c4d67162cd2f6a6c9876eaec4fb626c5867e0eaf_22_08_08_03_03_53/0?type=T#L273
      

      logs

      Attachments

        Issue Links

          Activity

            People

              luke.pearson@mongodb.com Luke Pearson
              Xgen-BuildBaron-User xgen-buildbaron-user
              Votes:
              0 Vote for this issue
              Watchers:
              6 Start watching this issue

              Dates

                Created:
                Updated:
                Resolved: