Uploaded image for project: 'WiredTiger'
  1. WiredTiger
  2. WT-11029

failed: test_encypt01 cursor value mismatch [wiredtiger-mongo-v4.4 @ 4f9175a5]

    • Type: Icon: Build Failure Build Failure
    • Resolution: Gone away
    • Priority: Icon: Major - P3 Major - P3
    • None
    • Affects Version/s: None
    • Component/s: Python tests
    • Labels:
    • 5
    • StorEng - Defined Pipeline

      unit-test-with-compile on macos-1014

      Host: macos-1014-120.macstadium.build.10gen.cc
      Project: wiredtiger-mongo-v4.4
      Commit: 4f9175a5

      Task Logs:

      unit-test-with-compile task_log

      Logs:

      FAIL: test_encrypt01.test_encrypt01.test_encrypt(file.rotn.zlib.earlyLoadTrue) (subunit.RemotedTestCase)
      test_encrypt01.test_encrypt01.test_encrypt(file.rotn.zlib.earlyLoadTrue)
      ----------------------------------------------------------------------
      testtools.testresult.real._StringException: Traceback (most recent call last):
        File "/data/mci/b737befee810498fa53cf213b0c563c7/wiredtiger/test/suite/test_encrypt01.py", line 137, in test_encrypt
          self.assertEquals(cursor.get_value(), val)
        File "/opt/mongodbtoolchain/revisions/58337d205569da8c73e016c21707ef49221adf36/stow/osx-python3-v3.yTK/lib/python3.9/unittest/case.py", line 1329, in deprecated_func
          return original_func(*args, **kwargs)
        File "/opt/mongodbtoolchain/revisions/58337d205569da8c73e016c21707ef49221adf36/stow/osx-python3-v3.yTK/lib/python3.9/unittest/case.py", line 831, in assertEqual
          assertion_func(first, second, msg=msg)
        File "/opt/mongodbtoolchain/revisions/58337d205569da8c73e016c21707ef49221adf36/stow/osx-python3-v3.yTK/lib/python3.9/unittest/case.py", line 1211, in assertMultiLineEqual
          self.fail(self._formatMessage(msg, standardMsg))
        File "/opt/mongodbtoolchain/revisions/58337d205569da8c73e016c21707ef49221adf36/stow/osx-python3-v3.yTK/lib/python3.9/unittest/case.py", line 670, in fail
          raise self.failureException(msg)
      AssertionError: 'ghij[2234 chars]efghibabcdefghijabcdefghijabcdefghijabcdefghij[5519 chars]2127' != 'ghij[2234 chars]efghijabcdefghijabcdefghijabcdefghijabcdefghij[5519 chars]2127'
      Diff is 20115 characters long. Set self.maxDiff to None to see it.
      ======================================================================
      FAIL: test_encrypt01.test_encrypt01.test_encrypt(table.rotn-none.zlib.earlyLoadTrue) (subunit.RemotedTestCase)
      test_encrypt01.test_encrypt01.test_encrypt(table.rotn-none.zlib.earlyLoadTrue)
      ----------------------------------------------------------------------
      testtools.testresult.real._StringException: Traceback (most recent call last):
        File "/data/mci/b737befee810498fa53cf213b0c563c7/wiredtiger/test/suite/test_encrypt01.py", line 137, in test_encrypt
          self.assertEquals(cursor.get_value(), val)
        File "/opt/mongodbtoolchain/revisions/58337d205569da8c73e016c21707ef49221adf36/stow/osx-python3-v3.yTK/lib/python3.9/unittest/case.py", line 1329, in deprecated_func
          return original_func(*args, **kwargs)
        File "/opt/mongodbtoolchain/revisions/58337d205569da8c73e016c21707ef49221adf36/stow/osx-python3-v3.yTK/lib/python3.9/unittest/case.py", line 831, in assertEqual
          assertion_func(first, second, msg=msg)
        File "/opt/mongodbtoolchain/revisions/58337d205569da8c73e016c21707ef49221adf36/stow/osx-python3-v3.yTK/lib/python3.9/unittest/case.py", line 1211, in assertMultiLineEqual
          self.fail(self._formatMessage(msg, standardMsg))
        File "/opt/mongodbtoolchain/revisions/58337d205569da8c73e016c21707ef49221adf36/stow/osx-python3-v3.yTK/lib/python3.9/unittest/case.py", line 670, in fail
          raise self.failureException(msg)
      AssertionError: 'efgh[8955 chars]defghajabcdefghijabcdefghijabcdefghijabcdefghi[525 chars]e428' != 'efgh[8955 chars]defghijabcdefghijabcdefghijabcdefghijabcdefghi[525 chars]e428'
      Diff is 37011 characters long. Set self.maxDiff to None to see it.
      ----------------------------------------------------------------------
      Ran 7035 tests in 1777.578s
      

      logs

            Assignee:
            backlog-server-storage-engines Backlog - Storage Engines Team
            Reporter:
            Xgen-BuildBaron-User xgen-buildbaron-user
            Votes:
            0 Vote for this issue
            Watchers:
            5 Start watching this issue

              Created:
              Updated:
              Resolved: