Uploaded image for project: 'WiredTiger'
  1. WiredTiger
  2. WT-11397

Two simultaneous data corruption errors on v5.0, macos

    • Type: Icon: Build Failure Build Failure
    • Resolution: Works as Designed
    • Priority: Icon: Major - P3 Major - P3
    • None
    • Affects Version/s: None
    • Component/s: None
    • Labels:
    • NachoCheese - 2023-10-03

      unit-test-with-compile on macos-1014

      Host: macos-1014-120.macstadium.build.10gen.cc
      Project: wiredtiger-mongo-v5.0
      Commit: cf4f840f

      Task Logs:

      unit-test-with-compile task_log

      Logs:

      ERROR: test_rollback_to_stable10.test_rollback_to_stable10.test_rollback_to_stable_prepare(column.prepare) (subunit.RemotedTestCase)
      test_rollback_to_stable10.test_rollback_to_stable10.test_rollback_to_stable_prepare(column.prepare)
      ----------------------------------------------------------------------
      testtools.testresult.real._StringException: lost connection during test 'test_rollback_to_stable10.test_rollback_to_stable10.test_rollback_to_stable_prepare(column.prepare)'
      ======================================================================
      FAIL: test_encrypt01.test_encrypt01.test_encrypt(file.rotn.zlib.earlyLoadTrue) (subunit.RemotedTestCase)
      test_encrypt01.test_encrypt01.test_encrypt(file.rotn.zlib.earlyLoadTrue)
      ----------------------------------------------------------------------
      testtools.testresult.real._StringException: Traceback (most recent call last):
        File "/data/mci/cf114ad60777cca73ea3ba692d82449d/wiredtiger/test/suite/test_encrypt01.py", line 137, in test_encrypt
          self.assertEquals(cursor.get_value(), val)
        File "/opt/mongodbtoolchain/revisions/58337d205569da8c73e016c21707ef49221adf36/stow/osx-python3-v3.yTK/lib/python3.9/unittest/case.py", line 1329, in deprecated_func
          return original_func(*args, **kwargs)
        File "/opt/mongodbtoolchain/revisions/58337d205569da8c73e016c21707ef49221adf36/stow/osx-python3-v3.yTK/lib/python3.9/unittest/case.py", line 831, in assertEqual
          assertion_func(first, second, msg=msg)
        File "/opt/mongodbtoolchain/revisions/58337d205569da8c73e016c21707ef49221adf36/stow/osx-python3-v3.yTK/lib/python3.9/unittest/case.py", line 1211, in assertMultiLineEqual
          self.fail(self._formatMessage(msg, standardMsg))
        File "/opt/mongodbtoolchain/revisions/58337d205569da8c73e016c21707ef49221adf36/stow/osx-python3-v3.yTK/lib/python3.9/unittest/case.py", line 670, in fail
          raise self.failureException(msg)
      AssertionError: 'fghi[7878 chars]hijabbdefghijabcdefghijabcdefghijabcdefghijabc[132 chars]f419' != 'fghi[7878 chars]hijabcdefghijabcdefghijabcdefghijabcdefghijabc[132 chars]f419'
      Diff is 31917 characters long. Set self.maxDiff to None to see it.
      ======================================================================
      FAIL: test_encrypt01.test_encrypt01.test_encrypt(table.rotn-none.zlib.earlyLoadTrue) (subunit.RemotedTestCase)
      test_encrypt01.test_encrypt01.test_encrypt(table.rotn-none.zlib.earlyLoadTrue)
      ----------------------------------------------------------------------
      testtools.testresult.real._StringException: Traceback (most recent call last):
        File "/data/mci/cf114ad60777cca73ea3ba692d82449d/wiredtiger/test/suite/test_encrypt01.py", line 137, in test_encrypt
          self.assertEquals(cursor.get_value(), val)
        File "/opt/mongodbtoolchain/revisions/58337d205569da8c73e016c21707ef49221adf36/stow/osx-python3-v3.yTK/lib/python3.9/unittest/case.py", line 1329, in deprecated_func
          return original_func(*args, **kwargs)
        File "/opt/mongodbtoolchain/revisions/58337d205569da8c73e016c21707ef49221adf36/stow/osx-python3-v3.yTK/lib/python3.9/unittest/case.py", line 831, in assertEqual
          assertion_func(first, second, msg=msg)
        File "/opt/mongodbtoolchain/revisions/58337d205569da8c73e016c21707ef49221adf36/stow/osx-python3-v3.yTK/lib/python3.9/unittest/case.py", line 1211, in assertMultiLineEqual
          self.fail(self._formatMessage(msg, standardMsg))
        File "/opt/mongodbtoolchain/revisions/58337d205569da8c73e016c21707ef49221adf36/stow/osx-python3-v3.yTK/lib/python3.9/unittest/case.py", line 670, in fail
          raise self.failureException(msg)
      AssertionError: 'jabc[972 chars]fghij`bcdefghijabcdefghijabcdefghijabcdefghija[6243 chars]1442' != 'jabc[972 chars]fghijabcdefghijabcdefghijabcdefghijabcdefghija[6243 chars]1442'
      Diff is 16515 characters long. Set self.maxDiff to None to see it.
      ----------------------------------------------------------------------
      Ran 7053 tests in 1939.364s
      

      logs

      unit-test-with-compile task_log

      Logs:

      [1690443443:145940][21974:0x1157445c0], test_rollback_to_stable10.test_rollback_to_stable10.test_rollback_to_stable_prepare(column.prepare), file:rollback_to_stable10_2.wt, WT_CURSOR.next: int __wt_block_read_off(WT_SESSION_IMPL *, WT_BLOCK *, WT_ITEM *, uint32_t, wt_off_t, uint32_t, uint32_t), 311: rollback_to_stable10_2.wt: fatal read error: WT_ERROR: non-specific WiredTiger error
      

      logs

      unit-test-with-compile task_log

      Logs:

      [1690443443:161364][21974:0x1157445c0], test_rollback_to_stable10.test_rollback_to_stable10.test_rollback_to_stable_prepare(column.prepare), file:rollback_to_stable10_2.wt, WT_CURSOR.next: int __wt_block_read_off(WT_SESSION_IMPL *, WT_BLOCK *, WT_ITEM *, uint32_t, wt_off_t, uint32_t, uint32_t), 311: the process must exit and restart: WT_PANIC: WiredTiger library panic
      [1690443443:162638][21974:0x1157445c0], test_rollback_to_stable10.test_rollback_to_stable10.test_rollback_to_stable_prepare(column.prepare), file:rollback_to_stable10_2.wt, WT_CURSOR.next: void __wt_abort(WT_SESSION_IMPL *), 28: aborting WiredTiger library
      

      logs

            Assignee:
            backlog-server-storage-engines [DO NOT USE] Backlog - Storage Engines Team
            Reporter:
            Xgen-BuildBaron-User xgen-buildbaron-user
            Votes:
            0 Vote for this issue
            Watchers:
            6 Start watching this issue

              Created:
              Updated:
              Resolved: