Uploaded image for project: 'WiredTiger'
  1. WiredTiger
  2. WT-11389

incorrect data after salvage in test_txn19

    • Type: Icon: Build Failure Build Failure
    • Resolution: Gone away
    • Priority: Icon: Major - P3 Major - P3
    • None
    • Affects Version/s: None
    • Component/s: None
    • Labels:
    • 2023-11-28 - Anthill Tiger

      unit-test-with-compile on macos-1014

      Host: macos-1014-120.macstadium.build.10gen.cc
      Project: wiredtiger-mongo-v5.0
      Commit: 0e6d6ef0

      Task Logs:

      unit-test-with-compile task_log

      Logs:

      FAIL: test_txn19.test_txn19_meta.test_corrupt_meta(integer-row.zero-begin.WiredTiger) (subunit.RemotedTestCase)
      test_txn19.test_txn19_meta.test_corrupt_meta(integer-row.zero-begin.WiredTiger)
      ----------------------------------------------------------------------
      testtools.testresult.real._StringException: Traceback (most recent call last):
        File "/data/mci/5ee138fea3d66238ffed6026515e961e/wiredtiger/test/suite/test_txn19.py", line 559, in test_corrupt_meta
          self.checks(expect)
        File "/data/mci/5ee138fea3d66238ffed6026515e961e/wiredtiger/test/suite/test_txn19.py", line 468, in checks
          self.assertEqual(self.valuegen(key), value)
        File "/opt/mongodbtoolchain/revisions/58337d205569da8c73e016c21707ef49221adf36/stow/osx-python3-v3.yTK/lib/python3.9/unittest/case.py", line 831, in assertEqual
          assertion_func(first, second, msg=msg)
        File "/opt/mongodbtoolchain/revisions/58337d205569da8c73e016c21707ef49221adf36/stow/osx-python3-v3.yTK/lib/python3.9/unittest/case.py", line 1211, in assertMultiLineEqual
          self.fail(self._formatMessage(msg, standardMsg))
        File "/opt/mongodbtoolchain/revisions/58337d205569da8c73e016c21707ef49221adf36/stow/osx-python3-v3.yTK/lib/python3.9/unittest/case.py", line 670, in fail
          raise self.failureException(msg)
      AssertionError: '976A[740 chars]AAAAAAAAAAAAAAAAAAAAAAAAAAAAAAAAAAAAAAAAAAAAAA[233 chars]AAAA' != '976A[740 chars]AAAAA@AAAAAAAAAAAAAAAAAAAAAAAAAAAAAAAAAAAAAAAA[233 chars]AAAA'
      Diff is 3567 characters long. Set self.maxDiff to None to see it.
      ----------------------------------------------------------------------
      Ran 7222 tests in 1910.731s
      

      logs

            Assignee:
            backlog-server-storage-engines [DO NOT USE] Backlog - Storage Engines Team
            Reporter:
            Xgen-BuildBaron-User xgen-buildbaron-user
            Votes:
            0 Vote for this issue
            Watchers:
            7 Start watching this issue

              Created:
              Updated:
              Resolved: