Uploaded image for project: 'WiredTiger'
  1. WiredTiger
  2. WT-13986

dhandle not closed after drop in test_sweep03.py

    • Type: Icon: Build Failure Build Failure
    • Resolution: Unresolved
    • Priority: Icon: Major - P3 Major - P3
    • None
    • Affects Version/s: None
    • Component/s: None
    • StorEng - Defined Pipeline

      spinlock-gcc-test on rhel80

      Host: i-06e76e3c6af0bee3f
      Project: wiredtiger
      Commit: 6804e86e

      Task Logs:

      spinlock-gcc-test task_log

      Logs:

      [pid:31511]: FAIL: test_sweep03.test_sweep03.test_disable_idle_timeout_drop_force(var)
      ----------------------------------------------------------------------
      [pid:31511]: testtools.testresult.real._StringException: Traceback (most recent call last):
        File "/data/mci/828d7f53ad0d9759f51e35f7856f72ed/wiredtiger/test/suite/wttest.py", line 233, in _callTestMethod
          method()
        File "/data/mci/828d7f53ad0d9759f51e35f7856f72ed/wiredtiger/test/suite/test_sweep03.py", line 137, in test_disable_idle_timeout_drop_force
          self.assertEqual(close2, 1)
      AssertionError: 0 != 1
      ----------------------------------------------------------------------
      Ran 13861 tests in 3501.671s
      

      logs

            Assignee:
            backlog-server-storage-engines [DO NOT USE] Backlog - Storage Engines Team
            Reporter:
            Xgen-BuildBaron-User xgen-buildbaron-user
            Votes:
            0 Vote for this issue
            Watchers:
            5 Start watching this issue

              Created:
              Updated: