-
Type:
Build Failure
-
Resolution: Duplicate
-
Priority:
Major - P3
-
None
-
Affects Version/s: None
-
Component/s: Cursors
-
Storage Engines - Foundations
-
8,151.569
-
SE Foundations - Q4+ Backlog
-
None
-
0
unit-test on amazon2023-armv9-nonstandalone
Host: i-07171ac64d43ed2d1
Project: wiredtiger
Commit: 0458a5cb
Please refer to BF(G) Playbook for instructions on handling BF and BFG tickets as well as Auto-Resolution Rules
Task Logs:
unit-test task_log
Logs:
[pid:591814]: FAIL: test_sweep03.test_sweep03.test_disable_idle_timeout_drop_force(var)
----------------------------------------------------------------------
[pid:591814]: testtools.testresult.real._StringException: Traceback (most recent call last):
File "/data/mci/f7e9b815bd096cc98a223ea053cbd399/wiredtiger/test/suite/wttest.py", line 233, in _callTestMethod
method()
File "/data/mci/f7e9b815bd096cc98a223ea053cbd399/wiredtiger/test/suite/test_sweep03.py", line 137, in test_disable_idle_timeout_drop_force
self.assertEqual(close2, 1)
AssertionError: 0 != 1
----------------------------------------------------------------------
Ran 13896 tests in 3263.748s
- depends on
-
WT-13986 dhandle not closed after drop in test_sweep03.py
-
- Backlog
-