-
Type:
Build Failure
-
Resolution: Duplicate
-
Priority:
Major - P3
-
None
-
Affects Version/s: None
-
Component/s: Logging
-
Storage Engines - Persistence
-
491.6
-
StorEng - Defined Pipeline
-
None
-
6
Host: macos-14-amd64-8.mac.devprod.mongodb.com
Project: wiredtiger-mongo-v7.0
Commit: 1dfc1f84
Please refer to BF(G) Playbook for instructions on handling BF and BFG tickets as well as Auto-Resolution Rules
Task Logs:
make-check-test task_log
Logs:
56/109 Test #67: test_truncated_log ...............................***Failed 12.68 sec
make-check-test task_log
Logs:
[1791524436:281026][19986:0x7ff854ab5e00], WT_CURSOR.next: [WT_VERB_DEFAULT][ERROR]: int __posix_file_read(WT_FILE_HANDLE *, WT_SESSION *, wt_off_t, size_t, void *), 441: ././WiredTigerLog.0000000002: handle-read: pread: failed to read 128 bytes at offset 0: WT_ERROR: non-specific WiredTiger error [1791524436:281042][19986:0x7ff854ab5e00], WT_CURSOR.next: [WT_VERB_DEFAULT][ERROR]: int __log_fs_read(WT_SESSION_IMPL *, WT_FH *, wt_off_t, size_t, void *), 188: ./WiredTigerLog.0000000002: log read failure: WT_ERROR: non-specific WiredTiger error
make-check-test task_log
Logs:
test_truncated_log: FAILED: Did not traverse log printf record: Invalid argument
make-check-test task_log
Logs:
test_truncated_log: process aborting WiredTiger Error: void __wt_abort(WT_SESSION_IMPL *), 28: aborting WiredTiger library
make-check-test task_log
Logs:
The following tests FAILED: 67 - test_truncated_log (Failed)
Repro Artifacts:
- related to
-
WT-18938 failed: make-check-test on macos-14 [wiredtiger-mongo-v7.0 @ 1dfc1f84]
-
- Closed
-