ExportXMLWordPrintableJSON

    • Type: Build Failure
    • Resolution: Duplicate
    • Priority: Major - P3
    • None
    • Affects Version/s: None
    • Component/s: Not Applicable

      make-check-test on macos-14

      Host: macos-14-amd64-2.mac.devprod.mongodb.com
      Project: wiredtiger-mongo-v7.0
      Commit: 1dfc1f84
      Please refer to BF(G) Playbook for instructions on handling BF and BFG tickets as well as Auto-Resolution Rules

      Task Logs:

      make-check-test task_log

      Logs:

       56/109 Test  #67: test_truncated_log ...............................***Failed    4.49 sec
      

      logs

      make-check-test task_log

      Logs:

      [1792165479:895343][89166:0x7ff84cfc8e00], WT_CURSOR.next: [WT_VERB_DEFAULT][ERROR]: int __posix_file_read(WT_FILE_HANDLE *, WT_SESSION *, wt_off_t, size_t, void *), 441: ././WiredTigerLog.0000000001: handle-read: pread: failed to read 10240 bytes at offset 92160: WT_ERROR: non-specific WiredTiger error
      [1792165479:895367][89166:0x7ff84cfc8e00], WT_CURSOR.next: [WT_VERB_DEFAULT][ERROR]: int __log_fs_read(WT_SESSION_IMPL *, WT_FH *, wt_off_t, size_t, void *), 188: ./WiredTigerLog.0000000001: log read failure: WT_ERROR: non-specific WiredTiger error
      [1792165482:358148][89165:0x7ff84cfc8e00], WT_CURSOR.next: [WT_VERB_DEFAULT][ERROR]: int __posix_file_read(WT_FILE_HANDLE *, WT_SESSION *, wt_off_t, size_t, void *), 441: ././WiredTigerLog.0000000002: handle-read: pread: failed to read 128 bytes at offset 0: WT_ERROR: non-specific WiredTiger error
      [1792165482:358224][89165:0x7ff84cfc8e00], WT_CURSOR.next: [WT_VERB_DEFAULT][ERROR]: int __log_fs_read(WT_SESSION_IMPL *, WT_FH *, wt_off_t, size_t, void *), 188: ./WiredTigerLog.0000000002: log read failure: WT_ERROR: non-specific WiredTiger error
      

      logs

      make-check-test task_log

      Logs:

      test_truncated_log: FAILED: Did not traverse log printf record: Invalid argument
      

      logs

      make-check-test task_log

      Logs:

      test_truncated_log: process aborting
      WiredTiger Error: void __wt_abort(WT_SESSION_IMPL *), 28: aborting WiredTiger library
      

      logs

      make-check-test task_log

      Logs:

      The following tests FAILED:
      	 67 - test_truncated_log (Failed)
      

      logs

      Repro Artifacts:

            Assignee:
            [DO NOT USE] Backlog - Storage Engines Team
            Reporter:
            xgen-buildbaron-user
            Votes:
            0 Vote for this issue
            Watchers:
            1 Start watching this issue

              Created:
              Updated:
              Resolved: