Uploaded image for project: 'WiredTiger'
  1. WiredTiger
  2. WT-9246

unknown configuration key: 'object_target_size': Invalid argument

    • Type: Icon: Build Failure Build Failure
    • Resolution: Won't Do
    • Priority: Icon: Major - P3 Major - P3
    • None
    • Affects Version/s: None
    • Component/s: None
    • Labels:

      compatibility-test-for-newer-releases on compatibility-tests

      Host: i-099ea4325885c7c94
      Project: wiredtiger
      Commit: 1b1eef91

      Task Logs:

      compatibility-test-for-newer-releases task_log

      Logs:

      Verbose Error message
      [1651015450:992352][65448:0x7f0ababbbb80], wt, WT_SESSION.create: [WT_VERB_DEFAULT][ERROR]: config_check_search, 65: unknown configuration key: 'object_target_size': Invalid argument
      [1651015450:992399][65448:0x7f0ababbbb80], wt, WT_SESSION.create: [WT_VERB_DEFAULT][ERROR]: config_check, 122: Invalid value for key 'tiered_storage': expected a category: Invalid argument
      Link: https://evergreen.mongodb.com/task_log_raw/wiredtiger_compatibility_tests_compatibility_test_for_newer_releases_1b1eef9191b429fd2b75a66c1d50a9384e857b0d_22_04_26_22_48_37/0?type=T#L11216
      
      Evergreen YAML Script Failure
      Command failed: command encountered problem: error waiting on process '4d4b6232-ffc4-4ddc-8ae5-d94b16b97a45': exit status 1
      Command failed: directory /data/mci/b8c18d0585a229924c8464fd9da4954b/wiredtiger/cmake_build does not exist
      Command failed: directory /data/mci/b8c18d0585a229924c8464fd9da4954b/wiredtiger/cmake_build does not exist
      Link: https://evergreen.mongodb.com/task_log_raw/wiredtiger_compatibility_tests_compatibility_test_for_newer_releases_1b1eef9191b429fd2b75a66c1d50a9384e857b0d_22_04_26_22_48_37/0?type=T#L11219
      

      logs

            Assignee:
            sue.loverso@mongodb.com Susan LoVerso
            Reporter:
            Xgen-BuildBaron-User xgen-buildbaron-user
            Votes:
            0 Vote for this issue
            Watchers:
            3 Start watching this issue

              Created:
              Updated:
              Resolved: